Reaction Details
TargetCarbonic anhydrase 4
LigandBDBM11422
Substrate/CompetitorBDBM10856
Meas. Tech.CA Inhibition Assay
IC50 10.1±n/a nM
Citation Chen, HHGross, SLiao, JMcLaughlin, MDean, TSly, WSMay, JA 2H-Thieno[3,2-e]- and [2,3-e]-1,2-thiazine-6-sulfonamide 1,1-dioxides as ocular hypotensive agents: synthesis, carbonic anhydrase inhibition and evaluation in the rabbit. Bioorg Med Chem8:957-75 (2000) 
 
Carbonic anhydrase 4
Name:Carbonic anhydrase 4
Type:Enzyme
Mol. Mass.:35037.98
Organism:Homo sapiens (Human)
Description:P22748
Residue:312
BDBM11422
BDBM10856
NameBDBM11422
Synonyms:2-(3,4-Dimethoxyphenyl)-3-[(4-morpholinyl)methyl]-2H-thieno[3,2-e]-1,2-thiazine-6-sulfonamide 1,1-dioxide hydrochloride 2H-Thieno[3,2-e]-1,2-thiazine-6-sulfonamide 1,1-dioxide 29 | Compound 17m1
TypeSmall organic molecule
Emp. Form.C19H23N3O7S3
Mol. Mass.501.597
SMILESCOc1ccc(cc1OC)N1C(CN2CCOCC2)=Cc2cc(sc2S1(=O)=O)S(N)(=O)=O