Reaction Details
TargetEctonucleotide pyrophosphatase/phosphodiesterase family member 2
LigandBDBM321867
Substrate/Competitorn/a
Meas. Tech.ATX Assay
IC50 5.80±n/a nM
Citation Beattie, DBaettig, ULe Grand, DMLister, ASMcKenna, JPearce, DWSandham, DASteward, ORThomson, C Autotaxin inhibitors US Patent US10183025 Publication Date 1/22/2019
 
Ectonucleotide pyrophosphatase/phosphodiesterase family member 2
Name:Ectonucleotide pyrophosphatase/phosphodiesterase family member 2
Type:Enzyme
Mol. Mass.:99007.13
Organism:Homo sapiens (Human)
Description:Q13822
Residue:863
BDBM321867
NameBDBM321867
Synonyms:(E)-1-(4-(5-Methyl-1,2,4-oxadiazol-3-yl)piperidin-1-yl)-3-(2-((5-methyl-2H-tetrazol-2-yl)methyl)-4-(trifluoromethyl)phenyl)prop-2-en-1-one US9763957, Example 36
TypeSmall organic molecule
Emp. Form.C21H22F3N7O2
Mol. Mass.461.4403
SMILESCc1nnn(Cc2cc(ccc2\C=C\C(=O)N2CCC(CC2)c2noc(C)n2)C(F)(F)F)n1