Reaction Details
TargetEctonucleotide pyrophosphatase/phosphodiesterase family member 2
LigandBDBM321893
Substrate/Competitorn/a
Meas. Tech.ATX Assay
IC50 6.30±n/a nM
Citation Beattie, DBaettig, ULe Grand, DMLister, ASMcKenna, JPearce, DWSandham, DASteward, ORThomson, C Autotaxin inhibitors US Patent US10183025 Publication Date 1/22/2019
 
Ectonucleotide pyrophosphatase/phosphodiesterase family member 2
Name:Ectonucleotide pyrophosphatase/phosphodiesterase family member 2
Type:Enzyme
Mol. Mass.:99007.13
Organism:Homo sapiens (Human)
Description:Q13822
Residue:863
BDBM321893
NameBDBM321893
Synonyms:(E)-3-(4-Chloro-2-((5-methyl-2H-tetrazol-2-yl)methyl)phenyl)-1-(4-(4-methyl-1H-pyrazol-1-yl)piperidin-1-yl)prop-2-en-1-one US9763957, Example 28
TypeSmall organic molecule
Emp. Form.C21H24ClN7O
Mol. Mass.425.915
SMILESCc1cnn(c1)C1CCN(CC1)C(=O)\C=C\c1ccc(Cl)cc1Cn1nnc(C)n1