Reaction Details
TargetEctonucleotide pyrophosphatase/phosphodiesterase family member 2
LigandBDBM321956
Substrate/Competitorn/a
Meas. Tech.ATX Assay
IC50 5.50±n/a nM
Citation Beattie, DBaettig, ULe Grand, DMLister, ASMcKenna, JPearce, DWSandham, DASteward, ORThomson, C Autotaxin inhibitors US Patent US10183025 Publication Date 1/22/2019
 
Ectonucleotide pyrophosphatase/phosphodiesterase family member 2
Name:Ectonucleotide pyrophosphatase/phosphodiesterase family member 2
Type:Enzyme
Mol. Mass.:99007.13
Organism:Homo sapiens (Human)
Description:Q13822
Residue:863
BDBM321956
NameBDBM321956
Synonyms:(R,E)-tert-Butyl 2-(3-methyl-4-(3-(2-((5-methyl-2H-tetrazol-2-yl)methyl)-4-(trifluoromethyl)phenyl)acryloyl)piperazin-1-yl)acetate US9763957, Example 65
TypeSmall organic molecule
Emp. Form.C24H31F3N6O3
Mol. Mass.508.5365
SMILESC[C@@H]1CN(CC(=O)OC(C)(C)C)CCN1C(=O)\C=C\c1ccc(cc1Cn1nnc(C)n1)C(F)(F)F