Reaction Details
TargetEctonucleotide pyrophosphatase/phosphodiesterase family member 2
LigandBDBM322006
Substrate/Competitorn/a
Meas. Tech.ATX Assay
IC50 3.90±n/a nM
Citation Beattie, DBaettig, ULe Grand, DMLister, ASMcKenna, JPearce, DWSandham, DASteward, ORThomson, C Autotaxin inhibitors US Patent US10183025 Publication Date 1/22/2019
 
Ectonucleotide pyrophosphatase/phosphodiesterase family member 2
Name:Ectonucleotide pyrophosphatase/phosphodiesterase family member 2
Type:Enzyme
Mol. Mass.:99007.13
Organism:Homo sapiens (Human)
Description:Q13822
Residue:863
BDBM322006
NameBDBM322006
Synonyms:(R,E)-3-(4-Chloro-2-((5-methyl-2H-tetrazol-2-yl)methyl)phenyl)-1-(2-methyl-4-((5-methyl-1,2,4-oxadiazol-3-yl)methyl)piperazin-1-yl)prop-2-en-1-one US9763957, Example 104
TypeSmall organic molecule
Emp. Form.C21H25ClN8O2
Mol. Mass.456.929
SMILESC[C@@H]1CN(Cc2noc(C)n2)CCN1C(=O)\C=C\c1ccc(Cl)cc1Cn1nnc(C)n1