Reaction Details
TargetEctonucleotide pyrophosphatase/phosphodiesterase family member 2
LigandBDBM322013
Substrate/Competitorn/a
Meas. Tech.ATX Assay
IC50 5.20±n/a nM
Citation Beattie, DBaettig, ULe Grand, DMLister, ASMcKenna, JPearce, DWSandham, DASteward, ORThomson, C Autotaxin inhibitors US Patent US10183025 Publication Date 1/22/2019
 
Ectonucleotide pyrophosphatase/phosphodiesterase family member 2
Name:Ectonucleotide pyrophosphatase/phosphodiesterase family member 2
Type:Enzyme
Mol. Mass.:99007.13
Organism:Homo sapiens (Human)
Description:Q13822
Residue:863
BDBM322013
NameBDBM322013
Synonyms:(E)-3-(4-Chloro-2-((5-methyl-2H-tetrazol-2-yl)methyl)phenyl)-1-(4-(5-((tetrahydro-2H-pyran-4-yl)methyl)-1,3,4-oxadiazol-2-yl)piperidin-1-yl)prop-2-en-1-one US9763957, Example 110
TypeSmall organic molecule
Emp. Form.C25H30ClN7O3
Mol. Mass.512.004
SMILESCc1nnn(Cc2cc(Cl)ccc2\C=C\C(=O)N2CCC(CC2)c2nnc(CC3CCOCC3)o2)n1