Reaction Details
Target5-hydroxytryptamine receptor 2C
LigandBDBM322071
Substrate/Competitorn/a
Meas. Tech.5-HT2C Receptor Binding Assay
Ki 5.40±n/a nM
Citation Sasaki, IToyoda, TYoshinaga, HNatsutani, ITakahashi, Y Pyrazole compound US Patent US10183913 Publication Date 1/22/2019
 
5-hydroxytryptamine receptor 2C
Name:5-hydroxytryptamine receptor 2C
Type:G Protein-Coupled Receptor (GPCR)
Mol. Mass.:51836.79
Organism:Homo sapiens (Human)
Description:P28335
Residue:458
BDBM322071
NameBDBM322071
Synonyms:1-[5-(Benzyloxy)-1-(3-phenylpropyl)-1H-pyrazol-3-yl]-N-methylmethanamine US11312688, Example 3
TypeSmall organic molecule
Emp. Form.C21H25N3O
Mol. Mass.335.4427
SMILESCNCc1cc(OCc2ccccc2)n(CCCc2ccccc2)n1