Reaction Details
Target5-hydroxytryptamine receptor 2C
LigandBDBM322072
Substrate/Competitorn/a
Meas. Tech.5-HT2C Receptor Binding Assay
Ki 4.40±n/a nM
Citation Sasaki, IToyoda, TYoshinaga, HNatsutani, ITakahashi, Y Pyrazole compound US Patent US10183913 Publication Date 1/22/2019
 
5-hydroxytryptamine receptor 2C
Name:5-hydroxytryptamine receptor 2C
Type:G Protein-Coupled Receptor (GPCR)
Mol. Mass.:51836.79
Organism:Homo sapiens (Human)
Description:P28335
Residue:458
BDBM322072
NameBDBM322072
Synonyms:1-[5-(benzyloxy)-1-(cyclohexylmethyl)-1H-pyrazol-3-yl]-N-methylmethanamine US11312688, Example 5 | US11576897, Example 5
TypeSmall organic molecule
Emp. Form.C19H27N3O
Mol. Mass.313.4372
SMILESCNCc1cc(OCc2ccccc2)n(CC2CCCCC2)n1