Reaction Details
Target5-hydroxytryptamine receptor 2C
LigandBDBM322078
Substrate/Competitorn/a
Meas. Tech.5-HT2C Receptor Binding Assay
Ki 7.70±n/a nM
Citation Sasaki, IToyoda, TYoshinaga, HNatsutani, ITakahashi, Y Pyrazole compound US Patent US10183913 Publication Date 1/22/2019
 
5-hydroxytryptamine receptor 2C
Name:5-hydroxytryptamine receptor 2C
Type:G Protein-Coupled Receptor (GPCR)
Mol. Mass.:51836.79
Organism:Homo sapiens (Human)
Description:P28335
Residue:458
BDBM322078
NameBDBM322078
Synonyms:US10183913, Example 122 | US11312688, Example 122
TypeSmall organic molecule
Emp. Form.C19H24ClN3O2
Mol. Mass.361.866
SMILESCNCc1cc(OCc2cccc(Cl)c2)n(CC2OC3CCC2C3)n1