Reaction Details
Target5-hydroxytryptamine receptor 2C
LigandBDBM322089
Substrate/Competitorn/a
Meas. Tech.5-HT2C Receptor Binding Assay
Ki 4.90±n/a nM
Citation Sasaki, IToyoda, TYoshinaga, HNatsutani, ITakahashi, Y Pyrazole compound US Patent US10183913 Publication Date 1/22/2019
 
5-hydroxytryptamine receptor 2C
Name:5-hydroxytryptamine receptor 2C
Type:G Protein-Coupled Receptor (GPCR)
Mol. Mass.:51836.79
Organism:Homo sapiens (Human)
Description:P28335
Residue:458
BDBM322089
NameBDBM322089
Synonyms:1-{5-[(2,5-difluorobenzyl)oxy]-1-(4-methylbenzyl)-1H-pyrazol-3-yl}-N-methylmethanamine US11312688, Example 230 | US11576897, Example 230
TypeSmall organic molecule
Emp. Form.C20H21F2N3O
Mol. Mass.357.397
SMILESCNCc1cc(OCc2cc(F)ccc2F)n(Cc2ccc(C)cc2)n1