Reaction Details
Target5-hydroxytryptamine receptor 2C
LigandBDBM322100
Substrate/Competitorn/a
Meas. Tech.5-HT2C Receptor Binding Assay
Ki 6.30±n/a nM
Citation Sasaki, IToyoda, TYoshinaga, HNatsutani, ITakahashi, Y Pyrazole compound US Patent US10183913 Publication Date 1/22/2019
 
5-hydroxytryptamine receptor 2C
Name:5-hydroxytryptamine receptor 2C
Type:G Protein-Coupled Receptor (GPCR)
Mol. Mass.:51836.79
Organism:Homo sapiens (Human)
Description:P28335
Residue:458
BDBM322100
NameBDBM322100
Synonyms:N-Methyl-1-{1-(3-methylbutyl)-5-[(2,4,5-trifluorobenzyl)-oxy]-1H-pyrazol-3-yl}methanamine hydrochloride US11312688, Example 283 | US11576897, Example 283
TypeSmall organic molecule
Emp. Form.C17H22F3N3O
Mol. Mass.341.3713
SMILESCNCc1cc(OCc2cc(F)c(F)cc2F)n(CCC(C)C)n1