Reaction Details
Target5-hydroxytryptamine receptor 2C
LigandBDBM322107
Substrate/Competitorn/a
Meas. Tech.5-HT2C Receptor Binding Assay
Ki 5.90±n/a nM
Citation Sasaki, IToyoda, TYoshinaga, HNatsutani, ITakahashi, Y Pyrazole compound US Patent US10183913 Publication Date 1/22/2019
 
5-hydroxytryptamine receptor 2C
Name:5-hydroxytryptamine receptor 2C
Type:G Protein-Coupled Receptor (GPCR)
Mol. Mass.:51836.79
Organism:Homo sapiens (Human)
Description:P28335
Residue:458
BDBM322107
NameBDBM322107
Synonyms:US10183913, Example 331 US11576897, Example 331
TypeSmall organic molecule
Emp. Form.C20H29N3O
Mol. Mass.327.4638
SMILESCNCc1cc(OCc2ccccc2)n(CC2(C)CCCCC2)n1