Reaction Details
Target5-hydroxytryptamine receptor 2C
LigandBDBM322123
Substrate/Competitorn/a
Meas. Tech.5-HT2C Receptor Binding Assay
Ki 11.0±n/a nM
Citation Sasaki, IToyoda, TYoshinaga, HNatsutani, ITakahashi, Y Pyrazole compound US Patent US10183913 Publication Date 1/22/2019
 
5-hydroxytryptamine receptor 2C
Name:5-hydroxytryptamine receptor 2C
Type:G Protein-Coupled Receptor (GPCR)
Mol. Mass.:51836.79
Organism:Homo sapiens (Human)
Description:P28335
Residue:458
BDBM322123
NameBDBM322123
Synonyms:US10183913, Example 442 | US11312688, Example 442
TypeSmall organic molecule
Emp. Form.C17H18ClF4N3O
Mol. Mass.391.791
SMILESCNCc1cc(OCc2cc(Cl)ccc2F)n(CC2(CC2)C(F)(F)F)n1