Reaction Details
TargetRho-associated protein kinase 1
LigandBDBM14029
Substrate/Competitorn/a
Meas. Tech.ROCK1 and ROCK2 Compound Selectivity
IC50 1130±n/a nM
Citation Poyurovsky, MKim, JLiu, KZanin-Zhorov, A Rho kinase inhibitors US Patent US10183931 Publication Date 1/22/2019
 
Rho-associated protein kinase 1
Name:Rho-associated protein kinase 1
Type:Serine/threonine-protein kinase
Mol. Mass.:158156.77
Organism:Homo sapiens (Human)
Description:Q13464
Residue:1354
BDBM14029
NameBDBM14029
Synonyms:(R)-TRANS-4-(1-AMINOETHYL)-N-(4-PYRIDYL) CYCLOHEXANECARBOXAMIDE US10183931, Y-27632 | Y-27632
TypeSmall organic molecule
Emp. Form.C14H21N3O
Mol. Mass.247.336
SMILES[H][C@@]1(CC[C@@]([H])(CC1)C(=O)Nc1ccncc1)[C@@H](C)N