Reaction Details
TargetP2X purinoceptor 3
LigandBDBM319914
Substrate/Competitorn/a
Meas. Tech.Intracellular Calcium Measurement to Assess Antagonist Activity at Human P2X3 and Human P2X2/3 Receptors
IC50 3.00±n/a nM
Citation Davenport, AJBräuer, NFischer, OMRotgeri, ARottmann, ANeagoe, INagel, JGodinho-Coelho, AKlar, J 1,3-thiazol-2-yl substituted benzamides US Patent US10183937 Publication Date 1/22/2019
 
P2X purinoceptor 3
Name:P2X purinoceptor 3
Type:Protein
Mol. Mass.:44292.02
Organism:Homo sapiens (Human)
Description:P56373
Residue:397
BDBM319914
NameBDBM319914
Synonyms:N-[1-(5- Chloro-3- fluoropyridin- 2-yl)ethyl]-3- (5-methyl- 1,3-thiazol-2- yl)-5- (tetrahydro- 2H-pyran-4- yloxy) benzamide US10202369, Example 81 | US10472354, Example 81
TypeSmall organic molecule
Emp. Form.C23H23ClFN3O3S
Mol. Mass.475.963
SMILESCC(NC(=O)c1cc(OC2CCOCC2)cc(c1)-c1ncc(C)s1)c1ncc(Cl)cc1F