Reaction Details
TargetP2X purinoceptor 3
LigandBDBM319958
Substrate/Competitorn/a
Meas. Tech.Intracellular Calcium Measurement to Assess Antagonist Activity at Human P2X3 and Human P2X2/3 Receptors
IC50 3.00±n/a nM
Citation Davenport, AJBräuer, NFischer, OMRotgeri, ARottmann, ANeagoe, INagel, JGodinho-Coelho, AKlar, J 1,3-thiazol-2-yl substituted benzamides US Patent US10183937 Publication Date 1/22/2019
 
P2X purinoceptor 3
Name:P2X purinoceptor 3
Type:Protein
Mol. Mass.:44292.02
Organism:Homo sapiens (Human)
Description:P56373
Residue:397
BDBM319958
NameBDBM319958
Synonyms:3-(5-Ethyl-1,3-thiazol-2-yl)-N-[(1R)-1-(2-methylpyrimidin-5-yl)ethyl]-5-(tetrahydro-2H-pyran-4-ylmethoxy)benzamide US10202369, Example 125 | US10472354, Example 125
TypeSmall organic molecule
Emp. Form.C25H30N4O3S
Mol. Mass.466.596
SMILESCCc1cnc(s1)-c1cc(OCC2CCOCC2)cc(c1)C(=O)N[C@H](C)c1cnc(C)nc1