Reaction Details
TargetP2X purinoceptor 3
LigandBDBM320136
Substrate/Competitorn/a
Meas. Tech.Intracellular Calcium Measurement to Assess Antagonist Activity at Human P2X3 and Human P2X2/3 Receptors
IC50 5.00±n/a nM
Citation Davenport, AJBräuer, NFischer, OMRotgeri, ARottmann, ANeagoe, INagel, JGodinho-Coelho, AKlar, J 1,3-thiazol-2-yl substituted benzamides US Patent US10183937 Publication Date 1/22/2019
 
P2X purinoceptor 3
Name:P2X purinoceptor 3
Type:Protein
Mol. Mass.:44292.02
Organism:Homo sapiens (Human)
Description:P56373
Residue:397
BDBM320136
NameBDBM320136
Synonyms:3-(5-methyl-1,3- thiazol-2-yl)-5-{[1- (2,2,2- trifluoroethyl) piperidin-4-yl]oxy}- N-{(1R)-1-[2- (trifluoromethyl) pyrimidin-5- yl]ethyl}benzamide US10202369, Example 310 | US10472354, Example 303
TypeSmall organic molecule
Emp. Form.C25H25F6N5O2S
Mol. Mass.573.554
SMILESC[C@@H](NC(=O)c1cc(OC2CCN(CC(F)(F)F)CC2)cc(c1)-c1ncc(C)s1)c1cnc(nc1)C(F)(F)F