Reaction Details
TargetNeuronal acetylcholine receptor subunit alpha-7
LigandBDBM322406
Substrate/Competitorn/a
Meas. Tech.Human alpha7 nAChR Binding Assay
Ki 36.0±n/a nM
Citation Acharya, RBurnett, DABursavich, MGCook, ASHarrison, BAKoenig, GMcriner, AJ Geminal substituted quinuclidine amide compounds as agonists of α-7 nicotonic acetylcholine receptors US Patent US10183938 Publication Date 1/22/2019
 
Neuronal acetylcholine receptor subunit alpha-7
Name:Neuronal acetylcholine receptor subunit alpha-7
Type:n/a
Mol. Mass.:56448.33
Organism:Homo sapiens (Human)
Description: CHRNA7 (NACHRA7)
Residue:502
BDBM322406
NameBDBM322406
Synonyms:(R)-7-cyclopropyl-N-(1'-azaspiro[cyclopropane-1,2'-bicyclo[2.2.2]octan]-3'-yl)benzo[b]thiophene-2-carboxamide | US10183938, Compound (R)-165
TypeSmall organic molecule
Emp. Form.C21H24N2OS
Mol. Mass.352.493
SMILESO=C(N[C@@H]1C2CCN(CC2)C11CC1)c1cc2cccc(C3CC3)c2s1