Reaction Details
Target5-hydroxytryptamine receptor 3A
LigandBDBM322422
Substrate/Competitorn/a
Meas. Tech.[3H]BRL 43694 Competition Binding (h-5HT3 Assay
Ki 130±n/a nM
Citation Acharya, RBurnett, DABursavich, MGCook, ASHarrison, BAKoenig, GMcriner, AJ Geminal substituted quinuclidine amide compounds as agonists of α-7 nicotonic acetylcholine receptors US Patent US10183938 Publication Date 1/22/2019
 
5-hydroxytryptamine receptor 3A
Name:5-hydroxytryptamine receptor 3A
Type:Protein
Mol. Mass.:55283.27
Organism:Homo sapiens (Human)
Description:P46098
Residue:478
BDBM322422
NameBDBM322422
Synonyms:(R)-7-methyl-N-(1'-azaspiro[cyclopropane-1,2'-bicyclo[2.2.2]octan]-3'-yl)benzo[b]thiophene-2-carboxamide | US10183938, Compound (R)-176
TypeSmall organic molecule
Emp. Form.C19H22N2OS
Mol. Mass.326.456
SMILESCc1cccc2cc(sc12)C(=O)N[C@@H]1C2CCN(CC2)C11CC1