Reaction Details
Target5-hydroxytryptamine receptor 3A
LigandBDBM322427
Substrate/Competitorn/a
Meas. Tech.[3H]BRL 43694 Competition Binding (h-5HT3 Assay
Ki 83.0±n/a nM
Citation Acharya, RBurnett, DABursavich, MGCook, ASHarrison, BAKoenig, GMcriner, AJ Geminal substituted quinuclidine amide compounds as agonists of α-7 nicotonic acetylcholine receptors US Patent US10183938 Publication Date 1/22/2019
 
5-hydroxytryptamine receptor 3A
Name:5-hydroxytryptamine receptor 3A
Type:Protein
Mol. Mass.:55283.27
Organism:Homo sapiens (Human)
Description:P46098
Residue:478
BDBM322427
NameBDBM322427
Synonyms:(R)-N-(1'-azaspiro[cyclopropane-1,2'-bicyclo[2.2.2]octan]-3'-yl)-7-(thiazol-2-yl)benzo[b]thiophene-2-carboxamide | US10183938, Compound (R)-181
TypeSmall organic molecule
Emp. Form.C21H21N3OS2
Mol. Mass.395.541
SMILESO=C(N[C@@H]1C2CCN(CC2)C11CC1)c1cc2cccc(-c3nccs3)c2s1