Reaction Details
TargetNeuronal acetylcholine receptor subunit alpha-7
LigandBDBM322448
Substrate/Competitorn/a
Meas. Tech.Human alpha7 nAChR Binding Assay
Ki 150±n/a nM
Citation Acharya, RBurnett, DABursavich, MGCook, ASHarrison, BAKoenig, GMcriner, AJ Geminal substituted quinuclidine amide compounds as agonists of α-7 nicotonic acetylcholine receptors US Patent US10183938 Publication Date 1/22/2019
 
Neuronal acetylcholine receptor subunit alpha-7
Name:Neuronal acetylcholine receptor subunit alpha-7
Type:n/a
Mol. Mass.:56448.33
Organism:Homo sapiens (Human)
Description: CHRNA7 (NACHRA7)
Residue:502
BDBM322448
NameBDBM322448
Synonyms:(R)-N-(1'-azaspiro[cyclopropane-1,2'-bicyclo[2.2.2]octan]-3'-yl)-3,4-dihydro-2H-thieno[3,2-h]chromene-8-carboxamide | US10183938, Compound (R)-201
TypeSmall organic molecule
Emp. Form.C21H24N2O2S
Mol. Mass.368.492
SMILESO=C(N[C@@H]1C2CCN(CC2)C11CC1)c1cc2ccc3CCCOc3c2s1