Reaction Details
TargetRAF proto-oncogene serine/threonine-protein kinase [Y340D,Y341D]
LigandBDBM322535
Substrate/Competitorn/a
IC50<4±n/a nM
Citation Bingham, MTestar, RGignoux, C Fused bicyclic (hetero)aromatic compounds useful for the treatment of cancers US Patent US10183939 Publication Date 1/22/2019
 
RAF proto-oncogene serine/threonine-protein kinase [Y340D,Y341D]
Name:RAF proto-oncogene serine/threonine-protein kinase [Y340D,Y341D]
Type:Serine/threonine-protein kinase
Mol. Mass.:72984.33
Organism:Homo sapiens (Human)
Description:P04049 Y340D Y341D
Residue:648
BDBM322535
NameBDBM322535
Synonyms:5-[3-[5-(4-fluorophenyl)-1H-imidazol-2-yl]chroman-6-yl]oxy-3,4-dihydro-1H-1,8-naphthyridin-2-one USRE49361, Example 13
TypeSmall organic molecule
Emp. Form.C26H21FN4O3
Mol. Mass.456.4683
SMILESFc1ccc(cc1)-c1cnc([nH]1)C1COc2ccc(Oc3ccnc4NC(=O)CCc34)cc2C1