Reaction Details
TargetRAF proto-oncogene serine/threonine-protein kinase [Y340D,Y341D]
LigandBDBM322540
Substrate/Competitorn/a
IC50<4±n/a nM
Citation Bingham, MTestar, RGignoux, C Fused bicyclic (hetero)aromatic compounds useful for the treatment of cancers US Patent US10183939 Publication Date 1/22/2019
 
RAF proto-oncogene serine/threonine-protein kinase [Y340D,Y341D]
Name:RAF proto-oncogene serine/threonine-protein kinase [Y340D,Y341D]
Type:Serine/threonine-protein kinase
Mol. Mass.:72984.33
Organism:Homo sapiens (Human)
Description:P04049 Y340D Y341D
Residue:648
BDBM322540
NameBDBM322540
Synonyms:5-[3-(5-phenyl-1H-pyrazol-3-yl)chroman-6-yl]oxy-3,4-dihydro-1H-1,8-naphthyridin-2-one USRE49361, Example 18
TypeSmall organic molecule
Emp. Form.C26H22N4O3
Mol. Mass.438.4779
SMILESO=C1CCc2c(Oc3ccc4OCC(Cc4c3)c3cc([nH]n3)-c3ccccc3)ccnc2N1