Reaction Details
TargetSomatostatin receptor type 4
LigandBDBM322581
Substrate/Competitorn/a
Meas. Tech.cAMP ASSAY
EC50 0.800±n/a nM
Citation Mazzaferro, RFerrara, MGiovannini, RLingard, I Aryl and heteroaryl-fused tetrahydro-1,4-oxazepine amides as somatostatin receptor subtype 4 (SSTR4) agonists US Patent US10183940 Publication Date 1/22/2019
 
Somatostatin receptor type 4
Name:Somatostatin receptor type 4
Type:Enzyme
Mol. Mass.:42015.38
Organism:Homo sapiens (Human)
Description:P31391
Residue:388
BDBM322581
NameBDBM322581
Synonyms:US10183940, Example 33
TypeSmall organic molecule
Emp. Form.C21H24N4O2
Mol. Mass.364.4409
SMILESCc1cccc2c(n[nH]c12)C(C)(C)NC(=O)c1cccc2CNCCOc12