Reaction Details
TargetTyrosine-protein kinase JAK2
LigandBDBM292112
Substrate/Competitorn/a
Ki<0.1±n/a nM
Citation Benjamin, NDabros, MThalladi, VR JAK kinase inhibitor compounds for treatment of respiratory disease US Patent US10183942 Publication Date 1/22/2019
 
Tyrosine-protein kinase JAK2
Name:Tyrosine-protein kinase JAK2
Type:Protein
Mol. Mass.:130684.68
Organism:Homo sapiens (Human)
Description:O60674
Residue:1132
BDBM292112
NameBDBM292112
Synonyms:US10100049, Example 9 US10526330, Example 9 US11299492, Example 9 | US11718616, Example 9
TypeSmall organic molecule
Emp. Form.C26H31FN6O
Mol. Mass.462.5623
SMILESCCN(C)CCN1CCc2[nH]c(nc2C1)-c1n[nH]c2cc(ccc12)-c1cc(F)c(O)cc1CC