Reaction Details
TargetArachidonate 5-lipoxygenase-activating protein
LigandBDBM323018
Substrate/Competitorn/a
Meas. Tech.FLAP Binding Assay (Test A)
IC50 37.0±n/a nM
Citation Broddefalk, JOEmtenäs, HFGranberg, KLLemurell, MAPettersen, DTPlowright, ATUlander, LJ Pyrazole derivatives useful as 5-lipoxygenase activating protein (FLAP) inhibitors US Patent US10183947 Publication Date 1/22/2019
 
Arachidonate 5-lipoxygenase-activating protein
Name:Arachidonate 5-lipoxygenase-activating protein
Type:Enzyme
Mol. Mass.:18159.90
Organism:Homo sapiens (Human)
Description:P20292
Residue:161
BDBM323018
NameBDBM323018
Synonyms:1-Methyl-4-[({(1R,2R)-2-[4-(3-methyl-1H- pyrazol-5- yl)benzoyl]cyclohexyl}carbonyl)amino]- 1H-pyrazole-5-carboxamide US10508119, Example 3 US11691978, Example 3
TypeSmall organic molecule
Emp. Form.C23H26N6O3
Mol. Mass.434.4909
SMILESCc1cc([nH]n1)-c1ccc(cc1)C(=O)[C@@H]1CCCC[C@H]1C(=O)Nc1cnn(C)c1C(N)=O