Reaction Details
TargetArachidonate 5-lipoxygenase-activating protein
LigandBDBM323020
Substrate/Competitorn/a
Meas. Tech.FLAP Binding Assay (Test A)
IC50 22.0±n/a nM
Citation Broddefalk, JOEmtenäs, HFGranberg, KLLemurell, MAPettersen, DTPlowright, ATUlander, LJ Pyrazole derivatives useful as 5-lipoxygenase activating protein (FLAP) inhibitors US Patent US10183947 Publication Date 1/22/2019
 
Arachidonate 5-lipoxygenase-activating protein
Name:Arachidonate 5-lipoxygenase-activating protein
Type:Enzyme
Mol. Mass.:18159.90
Organism:Homo sapiens (Human)
Description:P20292
Residue:161
BDBM323020
NameBDBM323020
Synonyms:(1S,2S or 1R,2R)-N-(3-Cyano-1-methyl- 1H-pyrazol-4-yl)-2-[4-(3-methyl-1H- pyrazol-5- yl)benzoyl]cyclohexanecarboxamide US10183947, Example 5b
TypeSmall organic molecule
Emp. Form.C23H24N6O2
Mol. Mass.416.4757
SMILESCc1cc([nH]n1)-c1ccc(cc1)C(=O)C1CCCCC1C(=O)Nc1cn(C)nc1C#N