Reaction Details
TargetArachidonate 5-lipoxygenase-activating protein
LigandBDBM323034
Substrate/Competitorn/a
Meas. Tech.FLAP Binding Assay (Test A)
IC50 28.0±n/a nM
Citation Broddefalk, JOEmtenäs, HFGranberg, KLLemurell, MAPettersen, DTPlowright, ATUlander, LJ Pyrazole derivatives useful as 5-lipoxygenase activating protein (FLAP) inhibitors US Patent US10183947 Publication Date 1/22/2019
 
Arachidonate 5-lipoxygenase-activating protein
Name:Arachidonate 5-lipoxygenase-activating protein
Type:Enzyme
Mol. Mass.:18159.90
Organism:Homo sapiens (Human)
Description:P20292
Residue:161
BDBM323034
NameBDBM323034
Synonyms:(1R,2R or 1S,2S)-N-(5-Cyano-1-methyl- 1H-pyrazol-4-yl)-2-[4-(1H-pyrazol-3- yl)benzoyl]cyclohexanecarboxamide US10183947, Example 18b | US10508119, Example 18b
TypeSmall organic molecule
Emp. Form.C22H22N6O2
Mol. Mass.402.4491
SMILESCn1ncc(NC(=O)C2CCCCC2C(=O)c2ccc(cc2)-c2cc[nH]n2)c1C#N