Reaction Details
TargetArachidonate 5-lipoxygenase-activating protein
LigandBDBM323040
Substrate/Competitorn/a
Meas. Tech.FLAP Binding Assay (Test A)
IC50 35.0±n/a nM
Citation Broddefalk, JOEmtenäs, HFGranberg, KLLemurell, MAPettersen, DTPlowright, ATUlander, LJ Pyrazole derivatives useful as 5-lipoxygenase activating protein (FLAP) inhibitors US Patent US10183947 Publication Date 1/22/2019
 
Arachidonate 5-lipoxygenase-activating protein
Name:Arachidonate 5-lipoxygenase-activating protein
Type:Enzyme
Mol. Mass.:18159.90
Organism:Homo sapiens (Human)
Description:P20292
Residue:161
BDBM323040
NameBDBM323040
Synonyms:4-[({(1R,2R)-2-[4-(1H-Pyrazol-5- yl)benzoyl]cyclohexyl}carbonyl)amino]- 1H-pyrazole-5-carboxamide US10508119, Example 23 US11691978, Example 23
TypeSmall organic molecule
Emp. Form.C21H22N6O3
Mol. Mass.406.4378
SMILESNC(=O)c1[nH]ncc1NC(=O)[C@@H]1CCCC[C@H]1C(=O)c1ccc(cc1)-c1ccn[nH]1