Reaction Details
TargetArachidonate 5-lipoxygenase-activating protein
LigandBDBM323046
Substrate/Competitorn/a
Meas. Tech.FLAP Binding Assay (Test A)
IC50 4.80±n/a nM
Citation Broddefalk, JOEmtenäs, HFGranberg, KLLemurell, MAPettersen, DTPlowright, ATUlander, LJ Pyrazole derivatives useful as 5-lipoxygenase activating protein (FLAP) inhibitors US Patent US10183947 Publication Date 1/22/2019
 
Arachidonate 5-lipoxygenase-activating protein
Name:Arachidonate 5-lipoxygenase-activating protein
Type:Enzyme
Mol. Mass.:18159.90
Organism:Homo sapiens (Human)
Description:P20292
Residue:161
BDBM323046
NameBDBM323046
Synonyms:(1R,2R)-N-(2-Methyl-4-oxo-4,5,6,7- tetrahydropyrazolo[1,5-a]pyrazin-3-yl)-2- [4-(1H-pyrazol-5- yl)benzoyl]cyclohexanecarboxamide US10508119, Example 29 US11691978, Example 29
TypeSmall organic molecule
Emp. Form.C24H26N6O3
Mol. Mass.446.5016
SMILESCc1nn2CCNC(=O)c2c1NC(=O)[C@@H]1CCCC[C@H]1C(=O)c1ccc(cc1)-c1cc[nH]n1