Reaction Details
TargetArachidonate 5-lipoxygenase-activating protein
LigandBDBM323054
Substrate/Competitorn/a
Meas. Tech.FLAP Binding Assay (Test A)
IC50 27.0±n/a nM
Citation Broddefalk, JOEmtenäs, HFGranberg, KLLemurell, MAPettersen, DTPlowright, ATUlander, LJ Pyrazole derivatives useful as 5-lipoxygenase activating protein (FLAP) inhibitors US Patent US10183947 Publication Date 1/22/2019
 
Arachidonate 5-lipoxygenase-activating protein
Name:Arachidonate 5-lipoxygenase-activating protein
Type:Enzyme
Mol. Mass.:18159.90
Organism:Homo sapiens (Human)
Description:P20292
Residue:161
BDBM323054
NameBDBM323054
Synonyms:4-[({(1R,2R or 1S,2S)-2-[2-Fluoro-4-(3- methyl-1H-pyrazol-5-yl)benzoyl] cyclohexyl}carbonyl)amino]-1-methyl-1H- pyrazole-5-carboxamide US10508119, Example 37
TypeSmall organic molecule
Emp. Form.C23H25FN6O3
Mol. Mass.452.4814
SMILESCc1cc([nH]n1)-c1ccc(C(=O)C2CCCCC2C(=O)Nc2cnn(C)c2C(N)=O)c(F)c1