Reaction Details
TargetArachidonate 5-lipoxygenase-activating protein
LigandBDBM323066
Substrate/Competitorn/a
Meas. Tech.FLAP Binding Assay (Test A)
IC50 44.0±n/a nM
Citation Broddefalk, JOEmtenäs, HFGranberg, KLLemurell, MAPettersen, DTPlowright, ATUlander, LJ Pyrazole derivatives useful as 5-lipoxygenase activating protein (FLAP) inhibitors US Patent US10183947 Publication Date 1/22/2019
 
Arachidonate 5-lipoxygenase-activating protein
Name:Arachidonate 5-lipoxygenase-activating protein
Type:Enzyme
Mol. Mass.:18159.90
Organism:Homo sapiens (Human)
Description:P20292
Residue:161
BDBM323066
NameBDBM323066
Synonyms:(1R,2R and 1S,1S)-N-(4-Cyano-3-methyl- 1,2-thiazol-5-yl)-2-[4-(1H-pyrazol-5- yl)benzoyl]cyclohexanecarboxamide US10508119, Example 49
TypeSmall organic molecule
Emp. Form.C22H21N5O2S
Mol. Mass.419.499
SMILESCc1nsc(NC(=O)C2CCCCC2C(=O)c2ccc(cc2)-c2ccn[nH]2)c1C#N