Reaction Details
TargetDual specificity mitogen-activated protein kinase kinase 1 [K97R]
LigandBDBM200424
Substrate/Competitorn/a
Meas. Tech.Radioactive Binding Assay
IC50 1.000±n/a nM
Citation Bock, MGMoebitz, HPanigrahi, SKPoddutoori, RSamajdar, S Compounds and compositions as inhibitors of MEK US Patent US9629836 Publication Date 4/25/2017
 
Dual specificity mitogen-activated protein kinase kinase 1 [K97R]
Name:Dual specificity mitogen-activated protein kinase kinase 1 [K97R]
Type:n/a
Mol. Mass.:43467.04
Organism:Homo sapiens (Human)
Description:Biotinylated full length MEK1 with an inactivating K97R ATP binding site mutation.
Residue:393
BDBM200424
NameBDBM200424
Synonyms:US10011599, Example 51 US9629836, 51
TypeSmall organic molecule
Emp. Form.C29H22ClF5N6O3
Mol. Mass.632.968
SMILESCc1nc2cnc3cc(F)c(cc3c2n1[C@H]1CCN(C[C@@H]1F)C(=O)CO)-c1ccc(Oc2nccc(n2)C(F)(F)F)cc1Cl