Reaction Details
TargetSodium channel protein type 9 subunit alpha
LigandBDBM50024244
Substrate/Competitorn/a
Meas. Tech.Electrophysiological Assay
IC50 928±n/a nM
Citation Sun, SZenova, AYChafeev, MJia, QZhang, ZOballa, RM Benzenesulfonamide compounds and their use as therapeutic agents US Patent US9630929 Publication Date 4/25/2017
 
Sodium channel protein type 9 subunit alpha
Name:Sodium channel protein type 9 subunit alpha
Type:Protein
Mol. Mass.:226375.97
Organism:Homo sapiens (Human)
Description:Q15858
Residue:1988
BDBM50024244
NameBDBM50024244
Synonyms:CHEMBL3325523 | US9630929, Example 46
TypeSmall organic molecule
Emp. Form.C20H19F3N4O3S2
Mol. Mass.484.515
SMILESFc1ccc(cc1)[C@@H]1CCNC[C@H]1COc1cc(F)c(cc1F)S(=O)(=O)Nc1ncns1