Reaction Details
TargetSodium channel protein type 5 subunit alpha
LigandBDBM50024216
Substrate/Competitorn/a
Meas. Tech.Electrophysiological Assay
IC50>10000±n/a nM
Citation Sun, SZenova, AYChafeev, MJia, QZhang, ZOballa, RM Benzenesulfonamide compounds and their use as therapeutic agents US Patent US9630929 Publication Date 4/25/2017
 
Sodium channel protein type 5 subunit alpha
Name:Sodium channel protein type 5 subunit alpha
Type:Enzyme
Mol. Mass.:226908.60
Organism:Homo sapiens (Human)
Description:Q14524
Residue:2016
BDBM50024216
NameBDBM50024216
Synonyms:CHEMBL3325536 | US9630929, Example 86
TypeSmall organic molecule
Emp. Form.C21H21ClF2N4O3S2
Mol. Mass.514.996
SMILESCN1CC[C@H]([C@H](COc2cc(F)c(cc2F)S(=O)(=O)Nc2ncns2)C1)c1ccc(Cl)cc1