Reaction Details
TargetSerine/threonine-protein kinase Chk1
LigandBDBM316492
Substrate/Competitorn/a
Meas. Tech.Kinase Inhibition Asssay
IC50 0.100±n/a nM
Citation Boyle, RGBoyce, RJ Pharmaceutically active pyrazine derivatives US Patent US9630931 Publication Date 4/25/2017
 
Serine/threonine-protein kinase Chk1
Name:Serine/threonine-protein kinase Chk1
Type:Enzyme Catalytic Domain
Mol. Mass.:54443.02
Organism:Homo sapiens (Human)
Description:gi_166295192
Residue:476
BDBM316492
NameBDBM316492
Synonyms:US9630931, Example 1
TypeSmall organic molecule
Emp. Form.C21H26ClN7O2
Mol. Mass.443.93
SMILESCOc1cc(CCNCC2CCNCC2)c(Cl)cc1NC(=O)Nc1cnc(cn1)C#N