Reaction Details
TargetSerine/threonine-protein kinase Chk1
LigandBDBM323145
Substrate/Competitorn/a
Meas. Tech.Kinase Inhibition Asssay
IC50 0.750±n/a nM
Citation Boyle, RGBoyce, RJ Pharmaceutically active pyrazine derivatives US Patent US9630931 Publication Date 4/25/2017
 
Serine/threonine-protein kinase Chk1
Name:Serine/threonine-protein kinase Chk1
Type:Enzyme Catalytic Domain
Mol. Mass.:54443.02
Organism:Homo sapiens (Human)
Description:gi_166295192
Residue:476
BDBM323145
NameBDBM323145
Synonyms:US9630931, Example 8
TypeSmall organic molecule
Emp. Form.C23H30ClN7O3
Mol. Mass.487.982
SMILESCC(C)Oc1cc(CCNCCN2CCOCC2)c(Cl)cc1NC(=O)Nc1cnc(cn1)C#N