Reaction Details
TargetSerine/threonine-protein kinase ATR
LigandBDBM323285
Substrate/Competitorn/a
Meas. Tech.Inhibition Assay
Ki<5±n/a nM
Citation Charrier, JBinch, HMHurley, DJCleveland, TJoshi, PFanning, LTPinder, JO Donnell, MNizarali Virani, AKnegtel, RMDurrant, SJYoung, SCStorck, PKay, DReaper, PMGrote, MP Compounds useful as inhibitors of ATR kinase US Patent US9630956 Publication Date 4/25/2017
 
Serine/threonine-protein kinase ATR
Name:Serine/threonine-protein kinase ATR
Type:Protein
Mol. Mass.:301404.58
Organism:Homo sapiens (Human)
Description:Q13535
Residue:2644
BDBM323285
NameBDBM323285
Synonyms:US9630956, Compound I-22
TypeSmall organic molecule
Emp. Form.C26H28N6O2
Mol. Mass.456.5395
SMILESCNCc1ccc(cc1)-c1cc(on1)-c1nc(cnc1N)-c1ccc(=O)n(c1)C1CCC(C)C1