Reaction Details
TargetSerine/threonine-protein kinase ATR
LigandBDBM323297
Substrate/Competitorn/a
Meas. Tech.Inhibition Assay
Ki<5±n/a nM
Citation Charrier, JBinch, HMHurley, DJCleveland, TJoshi, PFanning, LTPinder, JO Donnell, MNizarali Virani, AKnegtel, RMDurrant, SJYoung, SCStorck, PKay, DReaper, PMGrote, MP Compounds useful as inhibitors of ATR kinase US Patent US9630956 Publication Date 4/25/2017
 
Serine/threonine-protein kinase ATR
Name:Serine/threonine-protein kinase ATR
Type:Protein
Mol. Mass.:301404.58
Organism:Homo sapiens (Human)
Description:Q13535
Residue:2644
BDBM323297
NameBDBM323297
Synonyms:US9630956, Compound I-34
TypeSmall organic molecule
Emp. Form.C23H22N8O3
Mol. Mass.458.4726
SMILESCNCc1ccc(-c2nnc(o2)-c2nc(cnc2N)-c2ccc(=O)n(c2)C(C)C#N)c(OC)c1