Reaction Details
TargetSerine/threonine-protein kinase ATR
LigandBDBM323319
Substrate/Competitorn/a
Meas. Tech.Inhibition Assay
Ki<5±n/a nM
Citation Charrier, JBinch, HMHurley, DJCleveland, TJoshi, PFanning, LTPinder, JO Donnell, MNizarali Virani, AKnegtel, RMDurrant, SJYoung, SCStorck, PKay, DReaper, PMGrote, MP Compounds useful as inhibitors of ATR kinase US Patent US9630956 Publication Date 4/25/2017
 
Serine/threonine-protein kinase ATR
Name:Serine/threonine-protein kinase ATR
Type:Protein
Mol. Mass.:301404.58
Organism:Homo sapiens (Human)
Description:Q13535
Residue:2644
BDBM323319
NameBDBM323319
Synonyms:US9630956, Compound I-56
TypeSmall organic molecule
Emp. Form.C25H25FN6O2
Mol. Mass.460.5034
SMILESCNCc1ccc(-c2cc(on2)-c2nc(cnc2N)-c2ccc(=O)n(c2)C2CCCC2)c(F)c1