Reaction Details
TargetSerine/threonine-protein kinase ATR
LigandBDBM323382
Substrate/Competitorn/a
Meas. Tech.Inhibition Assay
Ki<5±n/a nM
Citation Charrier, JBinch, HMHurley, DJCleveland, TJoshi, PFanning, LTPinder, JO Donnell, MNizarali Virani, AKnegtel, RMDurrant, SJYoung, SCStorck, PKay, DReaper, PMGrote, MP Compounds useful as inhibitors of ATR kinase US Patent US9630956 Publication Date 4/25/2017
 
Serine/threonine-protein kinase ATR
Name:Serine/threonine-protein kinase ATR
Type:Protein
Mol. Mass.:301404.58
Organism:Homo sapiens (Human)
Description:Q13535
Residue:2644
BDBM323382
NameBDBM323382
Synonyms:US9630956, Compound I-119
TypeSmall organic molecule
Emp. Form.C27H28N6O2
Mol. Mass.468.5502
SMILESNc1ncc(nc1-c1cc(no1)-c1ccc(CNC2CC2)cc1)-c1c[nH]c(=O)c(c1)C1CCCC1