Reaction Details
TargetDipeptidyl peptidase 4
LigandBDBM11513
Substrate/CompetitorBDBM11057
Meas. Tech.Dipeptidyl Peptidase Inhibition Assay
IC50 240±n/a nM
Citation Xu, JWei, LMathvink, RHe, JPark, YJHe, HLeiting, BLyons, KAMarsilio, FPatel, RAWu, JKThornberry, NAWeber, AE Discovery of potent and selective phenylalanine based dipeptidyl peptidase IV inhibitors. Bioorg Med Chem Lett15:2533-6 (2005) 
 
Dipeptidyl peptidase 4
Name:Dipeptidyl peptidase 4
Type:Enzyme
Mol. Mass.:88271.01
Organism:Homo sapiens (Human)
Description:P27487
Residue:766
BDBM11513
BDBM11057
NameBDBM11513
Synonyms:(2S,3S)-3-[4-(3,5-difluorophenyl)phenyl]-1-[(3S)-3-fluoropyrrolidin-1-yl]-1-oxobutan-2-aminium; 2,2,2-trifluoroacetate | 3-(S)-fluoropyrrolidide 33
TypeSmall organic molecule
Emp. Form.C20H22F3N2O
Mol. Mass.363.3961
SMILESC[C@H]([C@H]([NH3+])C(=O)N1CC[C@H](F)C1)c1ccc(cc1)-c1cc(F)cc(F)c1