Reaction Details
TargetDual specificity protein kinase TTK
LigandBDBM229974
Substrate/Competitorn/a
Meas. Tech.Measurement of Inhibition of MPS1 Kinase
IC50 1.000±n/a nM
Citation Hoelder, SBlagg, JCheung, KJAtrash, BSheldrake, P Pharmacologically active compounds US Patent US10188642 Publication Date 1/29/2019
 
Dual specificity protein kinase TTK
Name:Dual specificity protein kinase TTK
Type:Protein
Mol. Mass.:97086.79
Organism:Homo sapiens (Human)
Description:P33981
Residue:857
BDBM229974
NameBDBM229974
Synonyms:US10188642, Example 2 | US9334286, 2
TypeSmall organic molecule
Emp. Form.C28H28N6O
Mol. Mass.464.5615
SMILESCOc1cc(ccc1Nc1cc2cc(ccc2cn1)-c1cnn(CC2CC2)c1)-c1cnc(C)n1C