Reaction Details
TargetDual specificity protein kinase TTK
LigandBDBM230935
Substrate/Competitorn/a
Meas. Tech.Measurement of Inhibition of MPS1 Kinase
IC50 2.00±n/a nM
Citation Hoelder, SBlagg, JCheung, KJAtrash, BSheldrake, P Pharmacologically active compounds US Patent US10188642 Publication Date 1/29/2019
 
Dual specificity protein kinase TTK
Name:Dual specificity protein kinase TTK
Type:Protein
Mol. Mass.:97086.79
Organism:Homo sapiens (Human)
Description:P33981
Residue:857
BDBM230935
NameBDBM230935
Synonyms:US10188642, Example 61 | US9334286, 61
TypeSmall organic molecule
Emp. Form.C26H29N5O4
Mol. Mass.475.5396
SMILESCOc1cc(ccc1Nc1cc2cc(ccc2cn1)-c1cnn(CC(C)(C)O)c1)C(=O)NCCO