Reaction Details
TargetDual specificity protein kinase TTK
LigandBDBM230943
Substrate/Competitorn/a
Meas. Tech.Measurement of Inhibition of MPS1 Kinase
IC50 2.00±n/a nM
Citation Hoelder, SBlagg, JCheung, KJAtrash, BSheldrake, P Pharmacologically active compounds US Patent US10188642 Publication Date 1/29/2019
 
Dual specificity protein kinase TTK
Name:Dual specificity protein kinase TTK
Type:Protein
Mol. Mass.:97086.79
Organism:Homo sapiens (Human)
Description:P33981
Residue:857
BDBM230943
NameBDBM230943
Synonyms:US10188642, Example 69 | US9334286, 69
TypeSmall organic molecule
Emp. Form.C31H36N6O3
Mol. Mass.540.6559
SMILESCOc1cc(ccc1Nc1cc2cc(ccc2cn1)-c1cnn(CC(C)(C)O)c1)-c1cnc(C)n1CC(C)(C)O