Reaction Details
TargetDiacylglycerol O-acyltransferase 2
LigandBDBM323626
Substrate/Competitorn/a
Meas. Tech.In Vitro DGAT2 Assay
IC50 2.40±n/a nM
Citation Futatsugi, K Diacylglycerol acyltransferase 2 inhibitors US Patent US10188653 Publication Date 1/29/2019
 
Diacylglycerol O-acyltransferase 2
Name:Diacylglycerol O-acyltransferase 2
Type:Multi-pass membrane protein
Mol. Mass.:43848.90
Organism:Homo sapiens (Human)
Description:Q96PD7
Residue:388
BDBM323626
NameBDBM323626
Synonyms:US10188653, Example 15 | US9789110, 15
TypeSmall organic molecule
Emp. Form.C28H32N4O5
Mol. Mass.504.5775
SMILESCCOc1ccccc1O[C@@H]1CCCN(C1)c1ncc(cn1)C(=O)NCc1ccc(cc1)C(C)C(O)=O