Reaction Details
TargetDiacylglycerol O-acyltransferase 2
LigandBDBM276749
Substrate/Competitorn/a
Meas. Tech.In Vitro DGAT2 Assay
IC50 7.90±n/a nM
Citation Futatsugi, K Diacylglycerol acyltransferase 2 inhibitors US Patent US10188653 Publication Date 1/29/2019
 
Diacylglycerol O-acyltransferase 2
Name:Diacylglycerol O-acyltransferase 2
Type:Multi-pass membrane protein
Mol. Mass.:43848.90
Organism:Homo sapiens (Human)
Description:Q96PD7
Residue:388
BDBM276749
NameBDBM276749
Synonyms:US10188653, Example 19.21 US9789110, 19.21 | WO2015140658, Example 19.21
TypeSmall organic molecule
Emp. Form.C22H30N4O4
Mol. Mass.414.498
SMILESCCOc1ccccc1O[C@@H]1CCCN(C1)c1ncc(cn1)C(=O)NC(C)(C)CO