Reaction Details
TargetHistone deacetylase 5
LigandBDBM19149
Substrate/Competitorn/a
Meas. Tech.HDAC Inhibition Assay
IC50 8750±n/a nM
Citation Hooker, JMWang, CSchroeder, FA Imaging histone deacetylases with a radiotracer using positron emission tomography US Patent US10188756 Publication Date 1/29/2019
 
Histone deacetylase 5
Name:Histone deacetylase 5
Type:Enzyme
Mol. Mass.:121968.61
Organism:Homo sapiens (Human)
Description:Q9UQL6
Residue:1122
BDBM19149
NameBDBM19149
Synonyms:CHEMBL98 SAHA US10188756, Compound SAHA US11505523, Compound SAHA US9353061, SAHA US9695181, Vorinostat Zolinza suberoylanilide hydroxamic acid
TypeSmall organic molecule
Emp. Form.C14H20N2O3
Mol. Mass.264.3202
SMILESONC(=O)CCCCCCC(=O)Nc1ccccc1