Reaction Details
TargetHistone deacetylase 1
LigandBDBM323709
Substrate/Competitorn/a
Meas. Tech.HDAC Inhibition Assay
IC50 0.300±n/a nM
Citation Hooker, JMWang, CSchroeder, FA Imaging histone deacetylases with a radiotracer using positron emission tomography US Patent US10188756 Publication Date 1/29/2019
 
Histone deacetylase 1
Name:Histone deacetylase 1
Type:Enzyme
Mol. Mass.:55090.27
Organism:Homo sapiens (Human)
Description:Q13547
Residue:482
BDBM323709
NameBDBM323709
Synonyms:US10188756, Compound CN133 | US11207431, Martinostat
TypeSmall organic molecule
Emp. Form.C22H30N2O2
Mol. Mass.354.4858
SMILESCN(Cc1ccc(\C=C\C(=O)NO)cc1)CC12CC3CC(CC(C3)C1)C2