Reaction Details
TargetHistone deacetylase 5
LigandBDBM323711
Substrate/Competitorn/a
Meas. Tech.HDAC Inhibition Assay
IC50 207±n/a nM
Citation Hooker, JMWang, CSchroeder, FA Imaging histone deacetylases with a radiotracer using positron emission tomography US Patent US10188756 Publication Date 1/29/2019
 
Histone deacetylase 5
Name:Histone deacetylase 5
Type:Enzyme
Mol. Mass.:121968.61
Organism:Homo sapiens (Human)
Description:Q9UQL6
Residue:1122
BDBM323711
NameBDBM323711
Synonyms:US10188756, Compound CN141
TypeSmall organic molecule
Emp. Form.C24H32N2O2
Mol. Mass.380.5231
SMILESCN(Cc1ccc2C=C(CCc2c1)C(=O)NO)CC12CC3CC(CC(C3)C1)C2